BDBM69253 3-methoxy-N-(4-pyridin-4-yl-1,3-thiazol-2-yl)benzamide::3-methoxy-N-(4-pyridin-4-yl-2-thiazolyl)benzamide::3-methoxy-N-[4-(4-pyridyl)thiazol-2-yl]benzamide::MLS000419358::SMR000320138::cid_5225043
SMILES COc1cccc(c1)C(=O)Nc1nc(cs1)-c1ccncc1
InChI Key InChIKey=WGAULCKIHFZVCU-UHFFFAOYSA-N
Data  1 EC50
  Tab Delimited (TSV)   2D SDfile   Computed 3D by Vconf -m prep SDfile
Find this compound or compounds like it in BindingDB:
Activity Spreadsheet -- Enzyme Inhibition Constant Data from BindingDB
Found 1 hit for monomerid = 69253
TargetGlycogen synthase kinase-3 beta(Homo sapiens (Human))
Broad Institute
Curated by PubChem BioAssay
LigandPNGBDBM69253(3-methoxy-N-(4-pyridin-4-yl-1,3-thiazol-2-yl)benza...)
Affinity DataEC50: >3.00E+5nM. Assay description: Keywords: GSK3beta, dose response, kinase, inhibition, HTS Assay Overview: The glycogen synthase kinase-3 beta (GSK-3b) is a known master regulator f...
In DepthDetails PCBioAssay