BDBM6934 N-({[3-(4-methoxyphenyl)-4-oxo-2H,4H-indeno[1,2-c]pyrazol-5-yl]carbamoyl}amino)benzamide::acylsemicarbazide deriv. 3v
SMILES COc1ccc(cc1)-c1n[nH]c2-c3cccc(NC(=O)NNC(=O)c4ccccc4)c3C(=O)c12
InChI Key InChIKey=VABZZXKALNNIOQ-UHFFFAOYSA-N
Data  2 IC50
  Tab Delimited (TSV)   2D SDfile   Computed 3D by Vconf -m prep SDfile
Find this compound or compounds like it in BindingDB:
Activity Spreadsheet -- Enzyme Inhibition Constant Data from BindingDB
Found 2 hits for monomerid = 6934
TargetCyclin-dependent kinase 4/G1/S-specific cyclin-D1(Homo sapiens (Human))
Dupont Pharmaceuticals
LigandPNGBDBM6934(N-({[3-(4-methoxyphenyl)-4-oxo-2H,4H-indeno[1,2-c]...)
Affinity DataIC50:  7nM. Assay description: The enzyme was assayed with substrate GST-Rb in the presence of 50 mM ATP/[gamma-32P] ATP, and capturing the 32-P labeled reaction products on GSH-Se...
In DepthDetails ArticlePubMed
TargetCyclin-dependent kinase 2/G1/S-specific cyclin-E1(Homo sapiens (Human))
Dupont Pharmaceuticals
LigandPNGBDBM6934(N-({[3-(4-methoxyphenyl)-4-oxo-2H,4H-indeno[1,2-c]...)
Affinity DataIC50:  12nM. Assay description: The enzyme was assayed with substrate GST-Rb in the presence of 50 mM ATP/[gamma-32P] ATP, and capturing the 32-P labeled reaction products on GSH-Se...
In DepthDetails ArticlePubMed