BDBM69365 2-(3,3-dimethyl-2-oxidanylidene-butylidene)-5-[(4-methoxy-3-oxidanyl-phenyl)methylidene]-1,3-thiazolidin-4-one::2-(3,3-dimethyl-2-oxobutylidene)-5-[(3-hydroxy-4-methoxyphenyl)methylidene]-1,3-thiazolidin-4-one::2-(3,3-dimethyl-2-oxobutylidene)-5-[(3-hydroxy-4-methoxyphenyl)methylidene]-4-thiazolidinone::5-(3-hydroxy-4-methoxy-benzylidene)-2-(2-keto-3,3-dimethyl-butylidene)thiazolidin-4-one::MLS000773832::SMR000364701::cid_4794224
SMILES COc1ccc(C=c2sc(=CC(=O)C(C)(C)C)[nH]c2=O)cc1O
InChI Key InChIKey=QGGLCGBRBYFWPB-FPLYRLCPSA-N
Data  2 EC50
  Tab Delimited (TSV)   2D SDfile   Computed 3D by Vconf -m prep SDfile
Find this compound or compounds like it in BindingDB:
Activity Spreadsheet -- Enzyme Inhibition Constant Data from BindingDB
Found 2 hits for monomerid = 69365
TargetHeat shock factor protein 1(Mus musculus)
Broad Institute
Curated by PubChem BioAssay
LigandPNGBDBM69365(2-(3,3-dimethyl-2-oxidanylidene-butylidene)-5-[(4-...)
Affinity DataEC50:  4.18E+4nM. Assay description: Keywords: Heat Shock Factor-1 (HSF-1), Stress Response, MG132, NIH3T3, Luminescence Assay Overview: Confirmation testing of small molecules identifie...
In DepthDetails PCBioAssay
TargetGlycogen synthase kinase-3 beta(Homo sapiens (Human))
Broad Institute
Curated by PubChem BioAssay
LigandPNGBDBM69365(2-(3,3-dimethyl-2-oxidanylidene-butylidene)-5-[(4-...)
Affinity DataEC50:  7.20E+3nM. Assay description: Keywords: GSK3beta, dose response, kinase, inhibition, HTS Assay Overview: The glycogen synthase kinase-3 beta (GSK-3b) is a known master regulator f...
In DepthDetails PCBioAssay