BDBM69555 (2-anilino-4-methyl-1,3-thiazol-5-yl)(phenyl)methanone::(2-anilino-4-methyl-1,3-thiazol-5-yl)-phenylmethanone::(2-anilino-4-methyl-5-thiazolyl)-phenylmethanone::(2-anilino-4-methyl-thiazol-5-yl)-phenyl-methanone::(4-methyl-2-phenylazanyl-1,3-thiazol-5-yl)-phenyl-methanone::MLS000860609::SMR000458693::cid_2814150
SMILES Cc1nc(Nc2ccccc2)sc1C(=O)c1ccccc1
InChI Key InChIKey=LEEHZZLZIUEJCZ-UHFFFAOYSA-N
Data  1 EC50
  Tab Delimited (TSV)   2D SDfile   Computed 3D by Vconf -m prep SDfile
Find this compound or compounds like it in BindingDB:
Activity Spreadsheet -- Enzyme Inhibition Constant Data from BindingDB
Found 1 hit for monomerid = 69555
TargetGlycogen synthase kinase-3 beta(Homo sapiens (Human))
Broad Institute
Curated by PubChem BioAssay
LigandPNGBDBM69555((2-anilino-4-methyl-1,3-thiazol-5-yl)(phenyl)metha...)
Affinity DataEC50:  1.98E+4nM. Assay description: Keywords: GSK3beta, dose response, kinase, inhibition, HTS Assay Overview: The glycogen synthase kinase-3 beta (GSK-3b) is a known master regulator f...
In DepthDetails PCBioAssay