BDBM69589 3-chloranyl-N-[2-(2-chlorophenyl)-5-oxidanyl-4-oxidanylidene-chromen-8-yl]benzamide::3-chloro-N-[2-(2-chlorophenyl)-5-hydroxy-4-keto-chromen-8-yl]benzamide::3-chloro-N-[2-(2-chlorophenyl)-5-hydroxy-4-oxo-1-benzopyran-8-yl]benzamide::3-chloro-N-[2-(2-chlorophenyl)-5-hydroxy-4-oxochromen-8-yl]benzamide::MLS000879351::SMR000128953::cid_5314942
SMILES Oc1ccc(NC(=O)c2cccc(Cl)c2)c2oc(cc(=O)c12)-c1ccccc1Cl
InChI Key InChIKey=KYONJIWWABRGQD-UHFFFAOYSA-N
Data  1 EC50
  Tab Delimited (TSV)   2D SDfile   Computed 3D by Vconf -m prep SDfile
Find this compound or compounds like it in BindingDB:
Activity Spreadsheet -- Enzyme Inhibition Constant Data from BindingDB
Found 1 hit for monomerid = 69589
TargetGlycogen synthase kinase-3 beta(Homo sapiens (Human))
Broad Institute
Curated by PubChem BioAssay
LigandPNGBDBM69589(3-chloranyl-N-[2-(2-chlorophenyl)-5-oxidanyl-4-oxi...)
Affinity DataEC50:  8.74E+4nM. Assay description: Keywords: GSK3beta, dose response, kinase, inhibition, HTS Assay Overview: The glycogen synthase kinase-3 beta (GSK-3b) is a known master regulator f...
In DepthDetails PCBioAssay