BDBM69627 2-[3-methoxy-4-(3-methylbutoxy)phenyl]-1-(2-morpholin-4-ylethyl)-4-oxidanyl-3-thiophen-2-ylcarbonyl-2H-pyrrol-5-one::3-hydroxy-5-(4-isoamoxy-3-methoxy-phenyl)-1-(2-morpholinoethyl)-4-(2-thenoyl)-3-pyrrolin-2-one::3-hydroxy-5-[4-(isopentyloxy)-3-methoxyphenyl]-1-[2-(4-morpholinyl)ethyl]-4-(2-thienylcarbonyl)-1,5-dihydro-2H-pyrrol-2-one::4-hydroxy-2-[3-methoxy-4-(3-methylbutoxy)phenyl]-1-(2-morpholin-4-ylethyl)-3-(thiophene-2-carbonyl)-2H-pyrrol-5-one::4-hydroxy-2-[3-methoxy-4-(3-methylbutoxy)phenyl]-1-[2-(4-morpholinyl)ethyl]-3-[oxo(thiophen-2-yl)methyl]-2H-pyrrol-5-one::MLS001179104::SMR000476070::cid_3378869
SMILES COc1cc(ccc1OCCC(C)C)C1C(C(=O)c2cccs2)C(=O)C(=O)N1CCN1CCOCC1
InChI Key InChIKey=FBEAOSKQLLDCIF-UHFFFAOYSA-N
Data  1 EC50
  Tab Delimited (TSV)   2D SDfile   Computed 3D by Vconf -m prep SDfile
Find this compound or compounds like it in BindingDB:
Activity Spreadsheet -- Enzyme Inhibition Constant Data from BindingDB
Found 1 hit for monomerid = 69627
TargetGlycogen synthase kinase-3 beta(Homo sapiens (Human))
Broad Institute
Curated by PubChem BioAssay
LigandPNGBDBM69627(2-[3-methoxy-4-(3-methylbutoxy)phenyl]-1-(2-morpho...)
Affinity DataEC50: >3.00E+5nM. Assay description: Keywords: GSK3beta, dose response, kinase, inhibition, HTS Assay Overview: The glycogen synthase kinase-3 beta (GSK-3b) is a known master regulator f...
In DepthDetails PCBioAssay