BDBM69642 4-[2-(homoveratrylamino)thiazol-4-yl]phenol::4-[2-[2-(3,4-dimethoxyphenyl)ethylamino]-1,3-thiazol-4-yl]phenol::4-[2-[2-(3,4-dimethoxyphenyl)ethylamino]-4-thiazolyl]phenol::MLS001184020::SMR000502906::cid_1299402
SMILES COc1ccc(CCNc2nc(cs2)-c2ccc(O)cc2)cc1OC
InChI Key InChIKey=WZTFEFMIYFVZAC-UHFFFAOYSA-N
Data  1 EC50
  Tab Delimited (TSV)   2D SDfile   Computed 3D by Vconf -m prep SDfile
Find this compound or compounds like it in BindingDB:
Activity Spreadsheet -- Enzyme Inhibition Constant Data from BindingDB
Found 1 hit for monomerid = 69642
TargetGlycogen synthase kinase-3 beta(Homo sapiens (Human))
Broad Institute
Curated by PubChem BioAssay
LigandPNGBDBM69642(4-[2-(homoveratrylamino)thiazol-4-yl]phenol | 4-[2...)
Affinity DataEC50: >3.00E+5nM. Assay description: Keywords: GSK3beta, dose response, kinase, inhibition, HTS Assay Overview: The glycogen synthase kinase-3 beta (GSK-3b) is a known master regulator f...
In DepthDetails PCBioAssay