BDBM69726 2-(4-Methyl-5-pyridin-4-yl-4H-[1,2,4]triazol-3-ylsulfanylmethyl)-benzonitrile::2-[(4-methyl-5-pyridin-4-yl-1,2,4-triazol-3-yl)sulfanylmethyl]benzenecarbonitrile::2-[(4-methyl-5-pyridin-4-yl-1,2,4-triazol-3-yl)sulfanylmethyl]benzonitrile::2-[[(4-methyl-5-pyridin-4-yl-1,2,4-triazol-3-yl)thio]methyl]benzonitrile::2-[[[4-methyl-5-(4-pyridyl)-1,2,4-triazol-3-yl]thio]methyl]benzonitrile::MLS001205790::SMR000524049::cid_977416
SMILES Cn1c(SCc2ccccc2C#N)nnc1-c1ccncc1
InChI Key InChIKey=PCAJRENLLOVIFR-UHFFFAOYSA-N
Data  1 EC50
  Tab Delimited (TSV)   2D SDfile   Computed 3D by Vconf -m prep SDfile
Find this compound or compounds like it in BindingDB:
Activity Spreadsheet -- Enzyme Inhibition Constant Data from BindingDB
Found 1 hit for monomerid = 69726
TargetGlycogen synthase kinase-3 beta(Homo sapiens (Human))
Broad Institute
Curated by PubChem BioAssay
LigandPNGBDBM69726(2-(4-Methyl-5-pyridin-4-yl-4H-[1,2,4]triazol-3-yls...)
Affinity DataEC50: >3.00E+5nM. Assay description: Keywords: GSK3beta, dose response, kinase, inhibition, HTS Assay Overview: The glycogen synthase kinase-3 beta (GSK-3b) is a known master regulator f...
In DepthDetails PCBioAssay