BDBM69911 (2E)-2-[(3-methylphenyl)methylidene]-N-(3-morpholin-4-ylpropyl)-3-oxidanylidene-4H-1,4-benzothiazine-6-carboxamide::(2E)-2-[(3-methylphenyl)methylidene]-N-(3-morpholin-4-ylpropyl)-3-oxo-4H-1,4-benzothiazine-6-carboxamide::(2E)-2-[(3-methylphenyl)methylidene]-N-[3-(4-morpholinyl)propyl]-3-oxo-4H-1,4-benzothiazine-6-carboxamide::(2E)-3-keto-2-(3-methylbenzylidene)-N-(3-morpholinopropyl)-4H-1,4-benzothiazine-6-carboxamide::MLS000925105::SMR000624060::cid_24789620
SMILES Cc1cccc(\C=C2\Sc3ccc(cc3NC2=O)C(=O)NCCCN2CCOCC2)c1
InChI Key InChIKey=XLXQMYARDSPICL-PXLXIMEGSA-N
Data  1 EC50
  Tab Delimited (TSV)   2D SDfile   Computed 3D by Vconf -m prep SDfile
Find this compound or compounds like it in BindingDB:
Activity Spreadsheet -- Enzyme Inhibition Constant Data from BindingDB
Found 1 hit for monomerid = 69911
TargetGlycogen synthase kinase-3 beta(Homo sapiens (Human))
Broad Institute
Curated by PubChem BioAssay
LigandPNGBDBM69911((2E)-2-[(3-methylphenyl)methylidene]-N-(3-morpholi...)
Affinity DataEC50: >3.00E+5nM. Assay description: Keywords: GSK3beta, dose response, kinase, inhibition, HTS Assay Overview: The glycogen synthase kinase-3 beta (GSK-3b) is a known master regulator f...
In DepthDetails PCBioAssay