BDBM69920 (2Z)-N-[2-(1-azepanyl)ethyl]-2-[(4-methoxyphenyl)methylidene]-4-methyl-3-oxo-1,4-benzothiazine-6-carboxamide::(2Z)-N-[2-(azepan-1-yl)ethyl]-2-[(4-methoxyphenyl)methylidene]-4-methyl-3-oxidanylidene-1,4-benzothiazine-6-carboxamide::(2Z)-N-[2-(azepan-1-yl)ethyl]-2-[(4-methoxyphenyl)methylidene]-4-methyl-3-oxo-1,4-benzothiazine-6-carboxamide::(2Z)-N-[2-(azepan-1-yl)ethyl]-3-keto-4-methyl-2-p-anisylidene-1,4-benzothiazine-6-carboxamide::MLS000950506::SMR000622206::cid_24789804
SMILES COc1ccc(\C=C2/Sc3ccc(cc3N(C)C2=O)C(=O)NCCN2CCCCCC2)cc1
InChI Key InChIKey=KMLDGVTYNJSARG-ULJHMMPZSA-N
Data  1 EC50
  Tab Delimited (TSV)   2D SDfile   Computed 3D by Vconf -m prep SDfile
Find this compound or compounds like it in BindingDB:
Activity Spreadsheet -- Enzyme Inhibition Constant Data from BindingDB
Found 1 hit for monomerid = 69920
TargetGlycogen synthase kinase-3 beta(Homo sapiens (Human))
Broad Institute
Curated by PubChem BioAssay
LigandPNGBDBM69920((2Z)-N-[2-(1-azepanyl)ethyl]-2-[(4-methoxyphenyl)m...)
Affinity DataEC50:  4.33E+4nM. Assay description: Keywords: GSK3beta, dose response, kinase, inhibition, HTS Assay Overview: The glycogen synthase kinase-3 beta (GSK-3b) is a known master regulator f...
In DepthDetails PCBioAssay