BDBM70030 MLS001221247::N'-[(4-methoxyphenyl)methyl]-N'-[2-oxidanylidene-2-[(phenylmethyl)amino]ethyl]-N-(1,3-thiazol-2-yl)butanediamide::N'-[(4-methoxyphenyl)methyl]-N'-[2-oxo-2-[(phenylmethyl)amino]ethyl]-N-(2-thiazolyl)butanediamide::N'-[2-(benzylamino)-2-keto-ethyl]-N'-p-anisyl-N-thiazol-2-yl-succinamide::N'-[2-(benzylamino)-2-oxoethyl]-N'-[(4-methoxyphenyl)methyl]-N-(1,3-thiazol-2-yl)butanediamide::N-(Benzylcarbamoyl-methyl)-N-(4-methoxy-benzyl)-N'-thiazol-2-yl-succinamide::SMR000600617::cid_3205306
SMILES COc1ccc(CN(CC(=O)NCc2ccccc2)C(=O)CCC(=O)Nc2nccs2)cc1
InChI Key InChIKey=QSQVMXCWDCRPCV-UHFFFAOYSA-N
Data  1 EC50
  Tab Delimited (TSV)   2D SDfile   Computed 3D by Vconf -m prep SDfile
Find this compound or compounds like it in BindingDB:
Activity Spreadsheet -- Enzyme Inhibition Constant Data from BindingDB
Found 1 hit for monomerid = 70030
TargetGlycogen synthase kinase-3 beta(Homo sapiens (Human))
Broad Institute
Curated by PubChem BioAssay
LigandPNGBDBM70030(MLS001221247 | N'-[(4-methoxyphenyl)methyl]-N'-[2-...)
Affinity DataEC50: >3.00E+5nM. Assay description: Keywords: GSK3beta, dose response, kinase, inhibition, HTS Assay Overview: The glycogen synthase kinase-3 beta (GSK-3b) is a known master regulator f...
In DepthDetails PCBioAssay