BDBM70162 (1S,3R,3aS,6aR)-5-ethyl-3-(2-methylpropyl)-4,6-dioxo-1-(4-phenylphenyl)-1,2,3a,6a-tetrahydropyrrolo[3,4-c]pyrrole-3-carboxylic acid methyl ester;2,2,2-trifluoroacetic acid::(1S,3R,3aS,6aR)-5-ethyl-3-isobutyl-4,6-diketo-1-(4-phenylphenyl)-1,2,3a,6a-tetrahydropyrrolo[3,4-c]pyrrole-3-carboxylic acid methyl ester;2,2,2-trifluoroacetic acid::MLS001362002::SMR000814381::cid_24892321::methyl (1S,3R,3aS,6aR)-5-ethyl-3-(2-methylpropyl)-4,6-bis(oxidanylidene)-1-(4-phenylphenyl)-1,2,3a,6a-tetrahydropyrrolo[3,4-c]pyrrole-3-carboxylate;2,2,2-tris(fluoranyl)ethanoic acid::methyl (1S,3R,3aS,6aR)-5-ethyl-3-(2-methylpropyl)-4,6-dioxo-1-(4-phenylphenyl)-1,2,3a,6a-tetrahydropyrrolo[3,4-c]pyrrole-3-carboxylate;2,2,2-trifluoroacetic acid
SMILES CCN1C(=O)[C@H]2[C@H](N[C@](CC(C)C)([C@H]2C1=O)C(=O)OC)c1ccc(cc1)-c1ccccc1
InChI Key InChIKey=XKUWSIFOPGPAHG-PIXQIBFHSA-N
Data  1 EC50
  Tab Delimited (TSV)   2D SDfile   Computed 3D by Vconf -m prep SDfile
Find this compound or compounds like it in BindingDB:
Activity Spreadsheet -- Enzyme Inhibition Constant Data from BindingDB
Found 1 hit for monomerid = 70162
TargetGlycogen synthase kinase-3 beta(Homo sapiens (Human))
Broad Institute
Curated by PubChem BioAssay
LigandPNGBDBM70162((1S,3R,3aS,6aR)-5-ethyl-3-(2-methylpropyl)-4,6-dio...)
Affinity DataEC50: >3.00E+5nM. Assay description: Keywords: GSK3beta, dose response, kinase, inhibition, HTS Assay Overview: The glycogen synthase kinase-3 beta (GSK-3b) is a known master regulator f...
In DepthDetails PCBioAssay