BDBM70600 4-[bis(5-hydroxy-3-methyl-1H-pyrazol-4-yl)methyl]-2-methoxyphenyl benzenesulfonate::MLS000531022::SMR000136000::[4-[bis(3-methyl-5-oxidanylidene-1,2-dihydropyrazol-4-yl)methyl]-2-methoxy-phenyl] benzenesulfonate::[4-[bis(3-methyl-5-oxo-1,2-dihydropyrazol-4-yl)methyl]-2-methoxyphenyl] benzenesulfonate::benzenesulfonic acid [4-[bis(3-keto-5-methyl-3-pyrazolin-4-yl)methyl]-2-methoxy-phenyl] ester::benzenesulfonic acid [4-[bis(3-methyl-5-oxo-1,2-dihydropyrazol-4-yl)methyl]-2-methoxyphenyl] ester::cid_2929691
SMILES COc1cc(ccc1OS(=O)(=O)c1ccccc1)C(c1c(C)[nH][nH]c1=O)c1c(C)[nH][nH]c1=O
InChI Key InChIKey=ADHWILFBTYTQNV-UHFFFAOYSA-N
Data  2 IC50
  Tab Delimited (TSV)   2D SDfile   Computed 3D by Vconf -m prep SDfile
Find this compound or compounds like it in BindingDB:
Activity Spreadsheet -- Enzyme Inhibition Constant Data from BindingDB
Found 2 hits for monomerid = 70600
TargetSentrin-specific protease 8(Homo sapiens (Human))
Burnham Center For Chemical Genomics
Curated by PubChem BioAssay
LigandPNGBDBM70600(4-[bis(5-hydroxy-3-methyl-1H-pyrazol-4-yl)methyl]-...)
Affinity DataIC50:  7.29E+4nM
In DepthDetails PCBioAssay
TargetSentrin-specific protease 8(Homo sapiens (Human))
Burnham Center For Chemical Genomics
Curated by PubChem BioAssay
LigandPNGBDBM70600(4-[bis(5-hydroxy-3-methyl-1H-pyrazol-4-yl)methyl]-...)
Affinity DataIC50:  7.29E+4nM
In DepthDetails PCBioAssay