BDBM70930 US9546164, 94::US9694002, 94
SMILES COc1ccc(CN2CCC(COc3cc(F)c(cc3C3CC3)C(=O)NS(C)(=O)=O)CC2)cc1F
InChI Key InChIKey=LNSGKRRBOFFWLA-UHFFFAOYSA-N
Data  2 IC50
  Tab Delimited (TSV)   2D SDfile   Computed 3D by Vconf -m prep SDfile
Find this compound or compounds like it in BindingDB:
Activity Spreadsheet -- Enzyme Inhibition Constant Data from BindingDB
Found 2 hits for monomerid = 70930
TargetSodium channel protein type 5 subunit alpha(Homo sapiens (Human))
Genentech
US Patent
LigandPNGBDBM70930(US9546164, 94 | US9694002, 94)
Affinity DataIC50:  150nMpH: 7.4 T: 2°C. Assay description: Radioligand Binding Studies: Saturation experiments. A representative compound of formula (I) having a methyl group was tritiated. Three tritiums wer...
In DepthDetails US Patent
TargetSodium channel protein type 1/10/11/2/3/4/5/8/9 subunit alpha(Homo sapiens (Human))
Genentech
US Patent
LigandPNGBDBM70930(US9546164, 94 | US9694002, 94)
Affinity DataIC50:  150nMpH: 7.4 T: 2°C. Assay description: Binding of this radioligand was preformed in 5 mL borosilicate glass test tubes at room temperature. Binding was initiated by adding membranes to inc...
In DepthDetails US Patent