BDBM71106 (E)-1-[4-(difluoromethoxy)phenyl]-3-(3-methoxyanilino)-2-(1-pyridin-1-iumyl)-3-sulfanylidene-1-propen-1-olate::(E)-1-[4-(difluoromethoxy)phenyl]-3-(3-methoxyanilino)-2-pyridin-1-ium-1-yl-3-sulfanylideneprop-1-en-1-olate::(E)-1-[4-(difluoromethoxy)phenyl]-3-(m-anisidino)-2-pyridin-1-ium-1-yl-3-thioxo-prop-1-en-1-olate::(E)-1-[4-[bis(fluoranyl)methoxy]phenyl]-3-[(3-methoxyphenyl)amino]-2-pyridin-1-ium-1-yl-3-sulfanylidene-prop-1-en-1-olate::MLS001005317::SMR000348664::cid_6313124
SMILES COc1cccc(NC(=S)[C-](C(=O)c2ccc(OC(F)F)cc2)[n+]2ccccc2)c1
InChI Key InChIKey=ZKRHCPRZKPAGQU-UHFFFAOYSA-N
Data  2 IC50
  Tab Delimited (TSV)   2D SDfile   Computed 3D by Vconf -m prep SDfile
Find this compound or compounds like it in BindingDB:
Activity Spreadsheet -- Enzyme Inhibition Constant Data from BindingDB
Found 2 hits for monomerid = 71106
TargetSentrin-specific protease 8(Homo sapiens (Human))
Burnham Center For Chemical Genomics
Curated by PubChem BioAssay
LigandPNGBDBM71106((E)-1-[4-(difluoromethoxy)phenyl]-3-(3-methoxyanil...)
Affinity DataIC50:  3.93E+3nM
In DepthDetails PCBioAssay
TargetSentrin-specific protease 8(Homo sapiens (Human))
Burnham Center For Chemical Genomics
Curated by PubChem BioAssay
LigandPNGBDBM71106((E)-1-[4-(difluoromethoxy)phenyl]-3-(3-methoxyanil...)
Affinity DataIC50:  3.93E+3nM
In DepthDetails PCBioAssay