BDBM71155 US9546164, 276::US9694002, 276
SMILES C[C@@H](N1CCC(COc2cc(F)c(cc2C2CC2)C(=O)NS(C)(=O)=O)CC1)c1cc(Cl)cc(c1)C(F)(F)F
InChI Key InChIKey=DDOIQOFHDMJGBP-OAHLLOKOSA-N
Data  2 IC50
  Tab Delimited (TSV)   2D SDfile   Computed 3D by Vconf -m prep SDfile
Find this compound or compounds like it in BindingDB:
Activity Spreadsheet -- Enzyme Inhibition Constant Data from BindingDB
Found 2 hits for monomerid = 71155
TargetSodium channel protein type 5 subunit alpha(Homo sapiens (Human))
Genentech
US Patent
LigandPNGBDBM71155(US9546164, 276 | US9694002, 276)
Affinity DataIC50:  5.70nMpH: 7.4 T: 2°C. Assay description: Radioligand Binding Studies: Saturation experiments. A representative compound of formula (I) having a methyl group was tritiated. Three tritiums wer...
Ligand InfoPC cidPC sid
In DepthDetails US Patent
TargetSodium channel protein type 1/10/11/2/3/4/5/8/9 subunit alpha(Homo sapiens (Human))
Genentech
US Patent
LigandPNGBDBM71155(US9546164, 276 | US9694002, 276)
Affinity DataIC50:  5.70nMpH: 7.4 T: 2°C. Assay description: Binding of this radioligand was preformed in 5 mL borosilicate glass test tubes at room temperature. Binding was initiated by adding membranes to inc...
Ligand InfoPC cidPC sid
In DepthDetails US Patent