BDBM71205 4-[(2E)-2-(2,6-dioxo-3-pyridinylidene)hydrazinyl]benzenesulfonamide::4-[(2E)-2-(2,6-dioxopyridin-3-ylidene)hydrazinyl]benzenesulfonamide::4-[(2E)-2-[2,6-bis(oxidanylidene)pyridin-3-ylidene]hydrazinyl]benzenesulfonamide::4-[(N'E)-N'-(2,6-diketo-3-pyridylidene)hydrazino]benzenesulfonamide::MLS000738241::SMR000528591::cid_6278102
SMILES NS(=O)(=O)c1ccc(NN=C2C=CC(=O)NC2=O)cc1
InChI Key InChIKey=XMIWKDSXKZEULQ-UHFFFAOYSA-N
Data  1 IC50
  Tab Delimited (TSV)   2D SDfile   Computed 3D by Vconf -m prep SDfile
Find this compound or compounds like it in BindingDB:
Activity Spreadsheet -- Enzyme Inhibition Constant Data from BindingDB
Found 1 hit for monomerid = 71205
TargetDNA (cytosine-5)-methyltransferase 1(Homo sapiens (Human))
Burnham Center For Chemical Genomics
Curated by PubChem BioAssay
LigandPNGBDBM71205(4-[(2E)-2-(2,6-dioxo-3-pyridinylidene)hydrazinyl]b...)
Affinity DataIC50:  7.65E+3nM. Assay description: Data Source: Sanford-Burnham Center for Chemical Genomics (SBCCG) Source Affiliation: Sanford-Burnham Medical Research Institute (SBMRI, San Diego, C...
Ligand InfoPC cidPC sid
In DepthDetails PCBioAssay