BDBM71496 US9694002, 519
SMILES CS(=O)(=O)NC(=O)c1cc(C2CC2)c(CN2CCC(CC2)Oc2ccc(Cl)c(c2)C(F)(F)F)cc1F
InChI Key InChIKey=NNHKHFSPYFNKEK-UHFFFAOYSA-N
Data  1 IC50
  Tab Delimited (TSV)   2D SDfile   Computed 3D by Vconf -m prep SDfile
Find this compound or compounds like it in BindingDB:
Activity Spreadsheet -- Enzyme Inhibition Constant Data from BindingDB
Found 1 hit for monomerid = 71496
TargetSodium channel protein type 1/10/11/2/3/4/5/8/9 subunit alpha(Homo sapiens (Human))
Genentech
US Patent
LigandPNGBDBM71496(US9694002, 519)
Affinity DataIC50:  8.10nMpH: 7.4 T: 2°C. Assay description: Binding of this radioligand was preformed in 5 mL borosilicate glass test tubes at room temperature. Binding was initiated by adding membranes to inc...
In DepthDetails US Patent