BDBM71663 MLS000038073::N-[11-[2-(diethylamino)-1-oxoethyl]-2-benzo[b][1]benzazepinyl]carbamic acid ethyl ester;hydrate;hydrochloride::N-[11-[2-(diethylamino)acetyl]benzo[b][1]benzazepin-2-yl]carbamic acid ethyl ester;hydrate;hydrochloride::SMR000057531::cid_6602780::ethyl N-[11-[2-(diethylamino)acetyl]benzo[b][1]benzazepin-2-yl]carbamate;hydrate;hydrochloride::ethyl N-[11-[2-(diethylamino)ethanoyl]benzo[b][1]benzazepin-2-yl]carbamate;hydrate;hydrochloride
SMILES CCOC(=O)Nc1ccc2C=Cc3ccccc3N(C(=O)CN(CC)CC)c2c1
InChI Key InChIKey=YNGLAICUWHSHGL-UHFFFAOYSA-N
Data  1 EC50
  Tab Delimited (TSV)   2D SDfile   Computed 3D by Vconf -m prep SDfile
Find this compound or compounds like it in BindingDB:
Activity Spreadsheet -- Enzyme Inhibition Constant Data from BindingDB
Found 1 hit for monomerid = 71663
TargetHeat shock factor protein 1(Mus musculus)
Broad Institute
Curated by PubChem BioAssay
LigandPNGBDBM71663(MLS000038073 | N-[11-[2-(diethylamino)-1-oxoethyl]...)
Affinity DataEC50: >2.60E+5nM. Assay description: Keywords: Heat Shock Factor-1 (HSF-1), Stress Response, MG132, NIH3T3, Luminescence Assay Overview: Confirmation testing of small molecules identifie...
In DepthDetails PCBioAssay