BDBM71671 7,7-dimethyl-2-(2-morpholin-4-ylethylamino)-5,8-dihydropyrano[4,3-b]pyridine-3-carbonitrile::7,7-dimethyl-2-(2-morpholinoethylamino)-5,8-dihydropyrano[4,3-b]pyridine-3-carbonitrile::7,7-dimethyl-2-[2-(4-morpholinyl)ethylamino]-5,8-dihydropyrano[4,3-b]pyridine-3-carbonitrile::MLS000071287::SMR000039713::cid_658654
SMILES CC1(C)Cc2nc(NCCN3CCOCC3)c(cc2CO1)C#N
InChI Key InChIKey=VYIOKQMROPCYDK-UHFFFAOYSA-N
Data  1 EC50
  Tab Delimited (TSV)   2D SDfile   Computed 3D by Vconf -m prep SDfile
Find this compound or compounds like it in BindingDB:
Activity Spreadsheet -- Enzyme Inhibition Constant Data from BindingDB
Found 1 hit for monomerid = 71671
TargetHeat shock factor protein 1(Mus musculus)
Broad Institute
Curated by PubChem BioAssay
LigandPNGBDBM71671(7,7-dimethyl-2-(2-morpholin-4-ylethylamino)-5,8-di...)
Affinity DataEC50: >2.60E+5nM. Assay description: Keywords: Heat Shock Factor-1 (HSF-1), Stress Response, MG132, NIH3T3, Luminescence Assay Overview: Confirmation testing of small molecules identifie...
In DepthDetails PCBioAssay