BDBM71814 4-methoxy-N-[2-(trifluoromethyl)phenyl]benzenesulfonamide::MLS000058927::SMR000069496::cid_755970
SMILES COc1ccc(cc1)S(=O)(=O)Nc1ccccc1C(F)(F)F
InChI Key InChIKey=JZLIFWIWUQANJV-UHFFFAOYSA-N
Data  1 EC50
  Tab Delimited (TSV)   2D SDfile   Computed 3D by Vconf -m prep SDfile
Find this compound or compounds like it in BindingDB:
Activity Spreadsheet -- Enzyme Inhibition Constant Data from BindingDB
Found 1 hit for monomerid = 71814
TargetHeat shock factor protein 1(Mus musculus)
Broad Institute
Curated by PubChem BioAssay
LigandPNGBDBM71814(4-methoxy-N-[2-(trifluoromethyl)phenyl]benzenesulf...)
Affinity DataEC50: >2.60E+5nM. Assay description: Keywords: Heat Shock Factor-1 (HSF-1), Stress Response, MG132, NIH3T3, Luminescence Assay Overview: Confirmation testing of small molecules identifie...
In DepthDetails PCBioAssay