BDBM71923 6-({[1-(4-fluorophenyl)-1H-tetrazol-5-yl]thio}methyl)-N,N-dimethyl-1,3,5-triazine-2,4-diamine::6-[[1-(4-fluorophenyl)-1,2,3,4-tetrazol-5-yl]sulfanylmethyl]-N2,N2-dimethyl-1,3,5-triazine-2,4-diamine::6-[[1-(4-fluorophenyl)tetrazol-5-yl]sulfanylmethyl]-2-N,2-N-dimethyl-1,3,5-triazine-2,4-diamine::6-[[[1-(4-fluorophenyl)-5-tetrazolyl]thio]methyl]-N2,N2-dimethyl-1,3,5-triazine-2,4-diamine::MLS000538959::SMR000144775::[4-amino-6-[[[1-(4-fluorophenyl)tetrazol-5-yl]thio]methyl]-s-triazin-2-yl]-dimethyl-amine::cid_974762
SMILES CN(C)c1nc(N)nc(CSc2nnnn2-c2ccc(F)cc2)n1
InChI Key InChIKey=VCNPCMAGVUNGHH-UHFFFAOYSA-N
Data  1 EC50
  Tab Delimited (TSV)   2D SDfile   Computed 3D by Vconf -m prep SDfile
Find this compound or compounds like it in BindingDB:
Activity Spreadsheet -- Enzyme Inhibition Constant Data from BindingDB
Found 1 hit for monomerid = 71923
TargetHeat shock factor protein 1(Mus musculus)
Broad Institute
Curated by PubChem BioAssay
LigandPNGBDBM71923(6-({[1-(4-fluorophenyl)-1H-tetrazol-5-yl]thio}meth...)
Affinity DataEC50: >2.60E+5nM. Assay description: Keywords: Heat Shock Factor-1 (HSF-1), Stress Response, MG132, NIH3T3, Luminescence Assay Overview: Confirmation testing of small molecules identifie...
In DepthDetails PCBioAssay