BDBM71948 1-(2,1,3-benzothiadiazol-4-ylsulfonyl)-4-(3,4,5-trimethoxyphenyl)-1H-pyrazol-3-amine::1-(2,1,3-benzothiadiazol-4-ylsulfonyl)-4-(3,4,5-trimethoxyphenyl)-3-pyrazolamine::1-(2,1,3-benzothiadiazol-4-ylsulfonyl)-4-(3,4,5-trimethoxyphenyl)pyrazol-3-amine::MLS000531238::SMR000136218::[1-piazthiol-4-ylsulfonyl-4-(3,4,5-trimethoxyphenyl)pyrazol-3-yl]amine::cid_2223423
SMILES COc1cc(cc(OC)c1OC)-c1cn(nc1N)S(=O)(=O)c1cccc2nsnc12
InChI Key InChIKey=XLUPUMSSTNDXAY-UHFFFAOYSA-N
Data  1 EC50
  Tab Delimited (TSV)   2D SDfile   Computed 3D by Vconf -m prep SDfile
Find this compound or compounds like it in BindingDB:
Activity Spreadsheet -- Enzyme Inhibition Constant Data from BindingDB
Found 1 hit for monomerid = 71948
TargetHeat shock factor protein 1(Mus musculus)
Broad Institute
Curated by PubChem BioAssay
LigandPNGBDBM71948(1-(2,1,3-benzothiadiazol-4-ylsulfonyl)-4-(3,4,5-tr...)
Affinity DataEC50: >2.60E+5nM. Assay description: Keywords: Heat Shock Factor-1 (HSF-1), Stress Response, MG132, NIH3T3, Luminescence Assay Overview: Confirmation testing of small molecules identifie...
In DepthDetails PCBioAssay