BDBM72097 1-(3-chlorobenzyl)-2-keto-6-(trifluoromethyl)nicotinamide::1-(3-chlorobenzyl)-2-oxo-6-(trifluoromethyl)-1,2-dihydro-3-pyridinecarboxamide::1-[(3-chlorophenyl)methyl]-2-oxidanylidene-6-(trifluoromethyl)pyridine-3-carboxamide::1-[(3-chlorophenyl)methyl]-2-oxo-6-(trifluoromethyl)-3-pyridinecarboxamide::1-[(3-chlorophenyl)methyl]-2-oxo-6-(trifluoromethyl)pyridine-3-carboxamide::MLS000325556::SMR000169863::cid_3849988
SMILES NC(=O)c1ccc(n(Cc2cccc(Cl)c2)c1=O)C(F)(F)F
InChI Key InChIKey=YUNVCEBUWGYADX-UHFFFAOYSA-N
Data  2 IC50  1 EC50
  Tab Delimited (TSV)   2D SDfile   Computed 3D by Vconf -m prep SDfile
Find this compound or compounds like it in BindingDB:
Activity Spreadsheet -- Enzyme Inhibition Constant Data from BindingDB
Found 3 hits for monomerid = 72097
TargetHeat shock factor protein 1(Mus musculus)
Broad Institute
Curated by PubChem BioAssay
LigandPNGBDBM72097(1-(3-chlorobenzyl)-2-keto-6-(trifluoromethyl)nicot...)
Affinity DataEC50: >2.60E+5nM. Assay description: Keywords: Heat Shock Factor-1 (HSF-1), Stress Response, MG132, NIH3T3, Luminescence Assay Overview: Confirmation testing of small molecules identifie...
In DepthDetails PCBioAssay
TargetPhospholipase A2(Homo sapiens (Human))
Burnham Center For Chemical Genomics
Curated by PubChem BioAssay
LigandPNGBDBM72097(1-(3-chlorobenzyl)-2-keto-6-(trifluoromethyl)nicot...)
Affinity DataIC50:  3.93E+3nM. Assay description: Data Source: Sanford-Burnham Center for Chemical Genomics (SBCCG) Source Affiliation: Sanford-Burnham Medical Research Institute (SBMRI, San Diego, C...
In DepthDetails PCBioAssay
TargetCysteine protease ATG4B(Homo sapiens (Human))
Burnham Center For Chemical Genomics
Curated by PubChem BioAssay
LigandPNGBDBM72097(1-(3-chlorobenzyl)-2-keto-6-(trifluoromethyl)nicot...)
Affinity DataIC50:  2.63E+4nM. Assay description: Data Source: Sanford-Burnham Center for Chemical Genomics (SBCCG) Source Affiliation: Sanford-Burnham Medical Research Institute (SBMRI, San Diego, C...
In DepthDetails PCBioAssay