BDBM72322 2-(phenylthio)-3-pyridinecarboxylic acid::2-(phenylthio)nicotinic acid::2-phenylsulfanylpyridine-3-carboxylic acid::MLS000416837::SMR000241793::cid_725029
SMILES OC(=O)c1cccnc1Sc1ccccc1
InChI Key InChIKey=MGIDOIDQQMOYTH-UHFFFAOYSA-N
Data  1 EC50
  Tab Delimited (TSV)   2D SDfile   Computed 3D by Vconf -m prep SDfile
Find this compound or compounds like it in BindingDB:
Activity Spreadsheet -- Enzyme Inhibition Constant Data from BindingDB
Found 1 hit for monomerid = 72322
TargetHeat shock factor protein 1(Mus musculus)
Broad Institute
Curated by PubChem BioAssay
LigandPNGBDBM72322(2-(phenylthio)-3-pyridinecarboxylic acid | 2-(phen...)
Affinity DataEC50: >2.60E+5nM. Assay description: Keywords: Heat Shock Factor-1 (HSF-1), Stress Response, MG132, NIH3T3, Luminescence Assay Overview: Confirmation testing of small molecules identifie...
In DepthDetails PCBioAssay