BDBM7247 (3Z)-5-bromo-3-({4-oxo-2H,4H,6H,7H-pyrano[3,4-c]pyrrol-1-yl}methylidene)-2,3-dihydro-1H-indol-2-one::pyrrollylactone indolinone driv. 15i
SMILES Brc1ccc2NC(=O)\C(=C/c3[nH]cc4c3CCOC4=O)c2c1
InChI Key InChIKey=NRXJRPGNKFISAO-WDZFZDKYSA-N
Data  4 IC50
  Tab Delimited (TSV)   2D SDfile   Computed 3D by Vconf -m prep SDfile
Find this compound or compounds like it in BindingDB:
Activity Spreadsheet -- Enzyme Inhibition Constant Data from BindingDB
Found 4 hits for monomerid = 7247
TargetCyclin-dependent kinase 2/G1/S-specific cyclin-E1(Homo sapiens (Human))
Sugen
LigandPNGBDBM7247((3Z)-5-bromo-3-({4-oxo-2H,4H,6H,7H-pyrano[3,4-c]py...)
Affinity DataIC50:  190nMpH: 7.4 T: 2°C. Assay description: For the assay, purified cdk/cyclin was added to polystyrene 96-well plates that were precoated with GST-Rb substrate in the presence of ATP. After i...
In DepthDetails ArticlePubMed
TargetProto-oncogene tyrosine-protein kinase Src(Homo sapiens (Human))
Sugen
LigandPNGBDBM7247((3Z)-5-bromo-3-({4-oxo-2H,4H,6H,7H-pyrano[3,4-c]py...)
Affinity DataIC50: >2.00E+4nMT: 2°C. Assay description: The assays were performed in 96-well microtiter plates that had been coated with a polyGluTyr peptide. Negative control wells received buffer alone w...
In DepthDetails ArticlePubMed
TargetPlatelet-derived growth factor receptor beta(Homo sapiens (Human))
Sugen
LigandPNGBDBM7247((3Z)-5-bromo-3-({4-oxo-2H,4H,6H,7H-pyrano[3,4-c]py...)
Affinity DataIC50:  1.80E+4nMT: 2°C. Assay description: IC50 is the inhibitor concentration which inhibits 50% of PDGFR-beta kinase autophosphorylation activity. The assay was performed in 96-well microtit...
In DepthDetails ArticlePubMed
TargetVascular endothelial growth factor receptor 2(Homo sapiens (Human))
Sugen
LigandPNGBDBM7247((3Z)-5-bromo-3-({4-oxo-2H,4H,6H,7H-pyrano[3,4-c]py...)
Affinity DataIC50:  1.10E+4nMT: 2°C. Assay description: The assays were performed in 96-well microtiter plates that had been coated with a polyGluTyr peptide. Negative control wells received buffer alone w...
In DepthDetails ArticlePubMed