BDBM72595 2-(1-azepanyl)-7-methoxy-4-methylquinoline;oxalic acid::2-(azepan-1-yl)-7-methoxy-4-methyl-quinoline;ethanedioic acid::2-(azepan-1-yl)-7-methoxy-4-methyl-quinoline;oxalic acid::2-(azepan-1-yl)-7-methoxy-4-methylquinoline;oxalic acid::MLS001018567::SMR000354779::cid_16195960
SMILES COc1ccc2c(C)cc(nc2c1)N1CCCCCC1
InChI Key InChIKey=IEOBQTYHOHTUKL-UHFFFAOYSA-N
Data  1 IC50  1 EC50
  Tab Delimited (TSV)   2D SDfile   Computed 3D by Vconf -m prep SDfile
Find this compound or compounds like it in BindingDB:
Activity Spreadsheet -- Enzyme Inhibition Constant Data from BindingDB
Found 2 hits for monomerid = 72595
TargetShort transient receptor potential channel 4(Mus musculus)
Johns Hopkins Ion Channel Center
Curated by PubChem BioAssay
LigandPNGBDBM72595(2-(1-azepanyl)-7-methoxy-4-methylquinoline;oxalic ...)
Affinity DataIC50:  2.38E+3nM. Assay description: Data Source: Johns Hopkins Ion Channel Center BioAssay Type: Confirmatory, Concentration-Response Relationship Observed Source (MLPCN Center Name): ...
In DepthDetails PCBioAssay
TargetHeat shock factor protein 1(Mus musculus)
Broad Institute
Curated by PubChem BioAssay
LigandPNGBDBM72595(2-(1-azepanyl)-7-methoxy-4-methylquinoline;oxalic ...)
Affinity DataEC50: >2.60E+5nM. Assay description: Keywords: Heat Shock Factor-1 (HSF-1), Stress Response, MG132, NIH3T3, Luminescence Assay Overview: Confirmation testing of small molecules identifie...
In DepthDetails PCBioAssay