BDBM72699 6-(1-azepanyl)-N2-methyl-5-nitro-N2-phenylpyrimidine-2,4-diamine::6-(azepan-1-yl)-2-N-methyl-5-nitro-2-N-phenylpyrimidine-2,4-diamine::6-(azepan-1-yl)-N2-methyl-5-nitro-N2-phenyl-pyrimidine-2,4-diamine::6-Azepan-1-yl-N*2*-methyl-5-nitro-N*2*-phenyl-pyrimidine-2,4-diamine::MLS000770093::SMR000434825::[4-amino-6-(azepan-1-yl)-5-nitro-pyrimidin-2-yl]-methyl-phenyl-amine::cid_3918587
SMILES CN(c1ccccc1)c1nc(N)c(c(n1)N1CCCCCC1)[N+]([O-])=O
InChI Key InChIKey=PNGOQSXNWGXMLT-UHFFFAOYSA-N
Data  1 EC50
  Tab Delimited (TSV)   2D SDfile   Computed 3D by Vconf -m prep SDfile
Find this compound or compounds like it in BindingDB:
Activity Spreadsheet -- Enzyme Inhibition Constant Data from BindingDB
Found 1 hit for monomerid = 72699
TargetHeat shock factor protein 1(Mus musculus)
Broad Institute
Curated by PubChem BioAssay
LigandPNGBDBM72699(6-(1-azepanyl)-N2-methyl-5-nitro-N2-phenylpyrimidi...)
Affinity DataEC50:  2.77E+4nM. Assay description: Keywords: Heat Shock Factor-1 (HSF-1), Stress Response, MG132, NIH3T3, Luminescence Assay Overview: Confirmation testing of small molecules identifie...
In DepthDetails PCBioAssay