BDBM72718 1-Methyl-1H-indole-3-carboxylic acid [1-(4-bromo-thiophen-2-yl)-meth-(E)-ylidene]-hydrazide::MLS000333260::N-[(4-bromanylthiophen-2-yl)methylideneamino]-1-methyl-indole-3-carboxamide::N-[(4-bromo-2-thienyl)methyleneamino]-1-methyl-indole-3-carboxamide::N-[(4-bromo-2-thiophenyl)methylideneamino]-1-methyl-3-indolecarboxamide::N-[(4-bromothiophen-2-yl)methylideneamino]-1-methylindole-3-carboxamide::SMR000436549::cid_2048117
SMILES Cn1cc(C(=O)NN=Cc2cc(Br)cs2)c2ccccc12
InChI Key InChIKey=BDQNAKXWAJQBRR-UHFFFAOYSA-N
Data  1 EC50
  Tab Delimited (TSV)   2D SDfile   Computed 3D by Vconf -m prep SDfile
Find this compound or compounds like it in BindingDB:
Activity Spreadsheet -- Enzyme Inhibition Constant Data from BindingDB
Found 1 hit for monomerid = 72718
TargetHeat shock factor protein 1(Mus musculus)
Broad Institute
Curated by PubChem BioAssay
LigandPNGBDBM72718(1-Methyl-1H-indole-3-carboxylic acid [1-(4-bromo-t...)
Affinity DataEC50:  4.29E+4nM. Assay description: Keywords: Heat Shock Factor-1 (HSF-1), Stress Response, MG132, NIH3T3, Luminescence Assay Overview: Confirmation testing of small molecules identifie...
In DepthDetails PCBioAssay