BDBM72941 2-(2-phenylethanoylamino)-6-(phenylmethyl)-5,7-dihydro-4H-thieno[2,3-c]pyridine-3-carboxamide;hydrochloride::2-[(1-oxo-2-phenylethyl)amino]-6-(phenylmethyl)-5,7-dihydro-4H-thieno[2,3-c]pyridine-3-carboxamide;hydrochloride::6-benzyl-2-[(2-phenylacetyl)amino]-5,7-dihydro-4H-thieno[2,3-c]pyridine-3-carboxamide;hydrochloride::MLS001167352::SMR000640809::cid_16798281
SMILES NC(=O)c1c(NC(=O)Cc2ccccc2)sc2CN(Cc3ccccc3)CCc12
InChI Key InChIKey=KKGGUJAJTQVBFN-UHFFFAOYSA-N
Data  1 EC50
  Tab Delimited (TSV)   2D SDfile   Computed 3D by Vconf -m prep SDfile
Find this compound or compounds like it in BindingDB:
Activity Spreadsheet -- Enzyme Inhibition Constant Data from BindingDB
Found 1 hit for monomerid = 72941
TargetHeat shock factor protein 1(Mus musculus)
Broad Institute
Curated by PubChem BioAssay
LigandPNGBDBM72941(2-(2-phenylethanoylamino)-6-(phenylmethyl)-5,7-dih...)
Affinity DataEC50: >2.60E+5nM. Assay description: Keywords: Heat Shock Factor-1 (HSF-1), Stress Response, MG132, NIH3T3, Luminescence Assay Overview: Confirmation testing of small molecules identifie...
In DepthDetails PCBioAssay