BDBM72981 MLS000949923::N-[5-(2,6-difluorophenoxy)-2,4-dinitrophenyl]-1-piperidinamine::N-[5-(2,6-difluorophenoxy)-2,4-dinitrophenyl]piperidin-1-amine::N-[5-[2,6-bis(fluoranyl)phenoxy]-2,4-dinitro-phenyl]piperidin-1-amine::SMR000462839::[5-(2,6-difluorophenoxy)-2,4-dinitro-phenyl]-piperidino-amine::cid_24789862
SMILES [O-][N+](=O)c1cc(c(Oc2c(F)cccc2F)cc1NN1CCCCC1)[N+]([O-])=O
InChI Key InChIKey=OLPDRPXAJJWJMY-UHFFFAOYSA-N
Data  1 EC50
  Tab Delimited (TSV)   2D SDfile   Computed 3D by Vconf -m prep SDfile
Find this compound or compounds like it in BindingDB:
Activity Spreadsheet -- Enzyme Inhibition Constant Data from BindingDB
Found 1 hit for monomerid = 72981
TargetHeat shock factor protein 1(Mus musculus)
Broad Institute
Curated by PubChem BioAssay
LigandPNGBDBM72981(MLS000949923 | N-[5-(2,6-difluorophenoxy)-2,4-dini...)
Affinity DataEC50: >2.60E+5nM. Assay description: Keywords: Heat Shock Factor-1 (HSF-1), Stress Response, MG132, NIH3T3, Luminescence Assay Overview: Confirmation testing of small molecules identifie...
Ligand InfoPC cidPC sid
In DepthDetails PCBioAssay