BDBM73125 (3S)-3-cyclopentyl-4-keto-3-phenyl-diazetidine-1,2-dicarboxylic acid dimethyl ester::(3S)-3-cyclopentyl-4-oxo-3-phenyldiazetidine-1,2-dicarboxylic acid dimethyl ester::MLS001250347::SMR000798346::cid_24856313::dimethyl (3S)-3-cyclopentyl-4-oxidanylidene-3-phenyl-1,2-diazetidine-1,2-dicarboxylate::dimethyl (3S)-3-cyclopentyl-4-oxo-3-phenyldiazetidine-1,2-dicarboxylate
SMILES COC(=O)N1N(C(=O)OC)[C@](C2CCCC2)(C1=O)c1ccccc1
InChI Key InChIKey=ZRHWCAFAIHTQKD-QGZVFWFLSA-N
Data  1 EC50
  Tab Delimited (TSV)   2D SDfile   Computed 3D by Vconf -m prep SDfile
Find this compound or compounds like it in BindingDB:
Activity Spreadsheet -- Enzyme Inhibition Constant Data from BindingDB
Found 1 hit for monomerid = 73125
TargetHeat shock factor protein 1(Mus musculus)
Broad Institute
Curated by PubChem BioAssay
LigandPNGBDBM73125((3S)-3-cyclopentyl-4-keto-3-phenyl-diazetidine-1,2...)
Affinity DataEC50:  1.49E+4nM. Assay description: Keywords: Heat Shock Factor-1 (HSF-1), Stress Response, MG132, NIH3T3, Luminescence Assay Overview: Confirmation testing of small molecules identifie...
In DepthDetails PCBioAssay