BDBM73952 MLS001221198::SMR000612090::[4-(4-Methoxy-phenyl)-piperazin-1-yl]-[1-(toluene-4-sulfonyl)-piperidin-3-yl]-methanone::[4-(4-methoxyphenyl)-1-piperazinyl]-[1-(4-methylphenyl)sulfonyl-3-piperidinyl]methanone::[4-(4-methoxyphenyl)piperazin-1-yl]-[1-(4-methylphenyl)sulfonylpiperidin-3-yl]methanone::[4-(4-methoxyphenyl)piperazino]-(1-tosyl-3-piperidyl)methanone::cid_2956517
SMILES COc1ccc(cc1)N1CCN(CC1)C(=O)C1CCCN(C1)S(=O)(=O)c1ccc(C)cc1
InChI Key InChIKey=WQIBHGSXBWUYAD-UHFFFAOYSA-N
Data  1 EC50
  Tab Delimited (TSV)   2D SDfile   Computed 3D by Vconf -m prep SDfile
Find this compound or compounds like it in BindingDB:
Activity Spreadsheet -- Enzyme Inhibition Constant Data from BindingDB
Found 1 hit for monomerid = 73952
TargetProtein LANA1(Human herpesvirus 8)
Broad Institute
Curated by PubChem BioAssay
LigandPNGBDBM73952(MLS001221198 | SMR000612090 | [4-(4-Methoxy-phenyl...)
Affinity DataEC50: >7.50E+4nM. Assay description: Primary Collaborators: Kenneth Kaye,Brigham & Womens,Boston MA,kkaye@rics.bwh.harvard.edu,617-525-4256 Chantal Beauchemin,Brigham & Womens,Boston MA,...
In DepthDetails PCBioAssay