BDBM73960 MLS000912996::N-(5-chloranyl-2-methyl-phenyl)-2-[(3,5-dimethyl-1,2-oxazol-4-yl)sulfonyl-(4-methoxyphenyl)amino]ethanamide::N-(5-chloro-2-methyl-phenyl)-2-(N-(3,5-dimethylisoxazol-4-yl)sulfonyl-4-methoxy-anilino)acetamide::N-(5-chloro-2-methylphenyl)-2-[N-[(3,5-dimethyl-1,2-oxazol-4-yl)sulfonyl]-4-methoxyanilino]acetamide::N-(5-chloro-2-methylphenyl)-2-[N-[(3,5-dimethyl-4-isoxazolyl)sulfonyl]-4-methoxyanilino]acetamide::SMR000622911::cid_16007558
SMILES COc1ccc(cc1)N(CC(=O)Nc1cc(Cl)ccc1C)S(=O)(=O)c1c(C)noc1C
InChI Key InChIKey=USFSVYQHJHRRBM-UHFFFAOYSA-N
Data  1 EC50
  Tab Delimited (TSV)   2D SDfile   Computed 3D by Vconf -m prep SDfile
Find this compound or compounds like it in BindingDB:
Activity Spreadsheet -- Enzyme Inhibition Constant Data from BindingDB
Found 1 hit for monomerid = 73960
TargetProtein LANA1(Human herpesvirus 8)
Broad Institute
Curated by PubChem BioAssay
LigandPNGBDBM73960(MLS000912996 | N-(5-chloranyl-2-methyl-phenyl)-2-[...)
Affinity DataEC50: >7.50E+4nM. Assay description: Primary Collaborators: Kenneth Kaye,Brigham & Womens,Boston MA,kkaye@rics.bwh.harvard.edu,617-525-4256 Chantal Beauchemin,Brigham & Womens,Boston MA,...
In DepthDetails PCBioAssay