BDBM73969 MLS000950288::N-cyclohexyl-2-(2,4-diketo-3-p-phenetyl-thieno[3,2-d]pyrimidin-1-yl)acetamide::N-cyclohexyl-2-[3-(4-ethoxyphenyl)-2,4-bis(oxidanylidene)thieno[3,2-d]pyrimidin-1-yl]ethanamide::N-cyclohexyl-2-[3-(4-ethoxyphenyl)-2,4-dioxo-1-thieno[3,2-d]pyrimidinyl]acetamide::N-cyclohexyl-2-[3-(4-ethoxyphenyl)-2,4-dioxothieno[3,2-d]pyrimidin-1-yl]acetamide::SMR000621718::cid_15992630
SMILES CCOc1ccc(cc1)-n1c(=O)n(CC(=O)NC2CCCCC2)c2ccsc2c1=O
InChI Key InChIKey=RRMAFMWJJBUPKF-UHFFFAOYSA-N
Data  1 EC50
  Tab Delimited (TSV)   2D SDfile   Computed 3D by Vconf -m prep SDfile
Find this compound or compounds like it in BindingDB:
Activity Spreadsheet -- Enzyme Inhibition Constant Data from BindingDB
Found 1 hit for monomerid = 73969
TargetProtein LANA1(Human herpesvirus 8)
Broad Institute
Curated by PubChem BioAssay
LigandPNGBDBM73969(MLS000950288 | N-cyclohexyl-2-(2,4-diketo-3-p-phen...)
Affinity DataEC50: >7.50E+4nM. Assay description: Primary Collaborators: Kenneth Kaye,Brigham & Womens,Boston MA,kkaye@rics.bwh.harvard.edu,617-525-4256 Chantal Beauchemin,Brigham & Womens,Boston MA,...
In DepthDetails PCBioAssay