BDBM74168 (2S)-2-[(2,6-difluorobenzoyl)amino]-3-methyl-butyric acid [2-(cyclopentylcarbamoylamino)-2-keto-ethyl] ester::(2S)-2-[[(2,6-difluorophenyl)-oxomethyl]amino]-3-methylbutanoic acid [2-[[(cyclopentylamino)-oxomethyl]amino]-2-oxoethyl] ester::MLS001077450::SMR000709461::[2-(cyclopentylcarbamoylamino)-2-oxidanylidene-ethyl] (2S)-2-[[2,6-bis(fluoranyl)phenyl]carbonylamino]-3-methyl-butanoate::[2-(cyclopentylcarbamoylamino)-2-oxoethyl] (2S)-2-[(2,6-difluorobenzoyl)amino]-3-methylbutanoate::cid_24819948
SMILES CC(C)[C@H](NC(=O)c1c(F)cccc1F)C(=O)OCC(=O)NC(=O)NC1CCCC1
InChI Key InChIKey=XZUPRPXNEWABOA-KRWDZBQOSA-N
Data  1 EC50
  Tab Delimited (TSV)   2D SDfile   Computed 3D by Vconf -m prep SDfile
Find this compound or compounds like it in BindingDB:
Activity Spreadsheet -- Enzyme Inhibition Constant Data from BindingDB
Found 1 hit for monomerid = 74168
TargetProtein LANA1(Human herpesvirus 8)
Broad Institute
Curated by PubChem BioAssay
LigandPNGBDBM74168((2S)-2-[(2,6-difluorobenzoyl)amino]-3-methyl-butyr...)
Affinity DataEC50: >7.50E+4nM. Assay description: Primary Collaborators: Kenneth Kaye,Brigham & Womens,Boston MA,kkaye@rics.bwh.harvard.edu,617-525-4256 Chantal Beauchemin,Brigham & Womens,Boston MA,...
In DepthDetails PCBioAssay