BDBM74857 10-Furan-2-ylmethyl-12-(4-methoxy-phenyl)-10,12-dihydro-7-oxa-8,10-diaza-benzo[a]anthracen-11-ylideneamine::MLS000331578::SMR000220667::cid_3879592
SMILES COc1ccc(cc1)C1c2c(Oc3ncn(Cc4ccco4)c(=N)c13)ccc1ccccc21
InChI Key InChIKey=TVZKPSIKBLOQJQ-UHFFFAOYSA-N
Data  1 EC50
  Tab Delimited (TSV)   2D SDfile   Computed 3D by Vconf -m prep SDfile
Find this compound or compounds like it in BindingDB:
Activity Spreadsheet -- Enzyme Inhibition Constant Data from BindingDB
Found 1 hit for monomerid = 74857
TargetImportin subunit alpha-1(Homo sapiens (Human))
Broad Institute
Curated by PubChem BioAssay
LigandPNGBDBM74857(10-Furan-2-ylmethyl-12-(4-methoxy-phenyl)-10,12-di...)
Affinity DataEC50: >5.00E+5nM. Assay description: Keywords: Counterscreen, FRET assay, HTS, YIC probe, Dose response, Assay Overview: This is a fluorescence resonance energy transfer (FRET)-based b...
In DepthDetails PCBioAssay