BDBM74866 2-(2,6-dimethylphenoxy)acetic acid [3-cyano-3-(1,3-dihydrobenzimidazol-2-ylidene)-2-keto-propyl] ester::2-(2,6-dimethylphenoxy)acetic acid [3-cyano-3-(1,3-dihydrobenzimidazol-2-ylidene)-2-oxopropyl] ester::MLS000335522::SMR000253276::[3-cyano-3-(1,3-dihydrobenzimidazol-2-ylidene)-2-oxidanylidene-propyl] 2-(2,6-dimethylphenoxy)ethanoate::[3-cyano-3-(1,3-dihydrobenzimidazol-2-ylidene)-2-oxopropyl] 2-(2,6-dimethylphenoxy)acetate::cid_5681629
SMILES Cc1cccc(C)c1OCC(=O)OCC(=O)C(C#N)c1nc2ccccc2[nH]1
InChI Key InChIKey=IATWYRHDJKMBQK-UHFFFAOYSA-N
Data  1 EC50
  Tab Delimited (TSV)   2D SDfile   Computed 3D by Vconf -m prep SDfile
Find this compound or compounds like it in BindingDB:
Activity Spreadsheet -- Enzyme Inhibition Constant Data from BindingDB
Found 1 hit for monomerid = 74866
TargetImportin subunit alpha-1(Homo sapiens (Human))
Broad Institute
Curated by PubChem BioAssay
LigandPNGBDBM74866(2-(2,6-dimethylphenoxy)acetic acid [3-cyano-3-(1,3...)
Affinity DataEC50: >5.00E+5nM. Assay description: Keywords: Counterscreen, FRET assay, HTS, YIC probe, Dose response, Assay Overview: This is a fluorescence resonance energy transfer (FRET)-based b...
In DepthDetails PCBioAssay