BDBM75211 2-(6,7-dimethoxy-3,4-dihydro-1H-isoquinolin-2-yl)-1-phenyl-ethanol::2-(6,7-dimethoxy-3,4-dihydro-1H-isoquinolin-2-yl)-1-phenylethanol::MLS001193391::SMR000592711::cid_4335971
SMILES COc1cc2CCN(CC(O)c3ccccc3)Cc2cc1OC
InChI Key InChIKey=BASXKILEZLTFQW-UHFFFAOYSA-N
Data  1 EC50
  Tab Delimited (TSV)   2D SDfile   Computed 3D by Vconf -m prep SDfile
Find this compound or compounds like it in BindingDB:
Activity Spreadsheet -- Enzyme Inhibition Constant Data from BindingDB
Found 1 hit for monomerid = 75211
TargetImportin subunit alpha-1(Homo sapiens (Human))
Broad Institute
Curated by PubChem BioAssay
LigandPNGBDBM75211(2-(6,7-dimethoxy-3,4-dihydro-1H-isoquinolin-2-yl)-...)
Affinity DataEC50:  8.48E+4nM. Assay description: Keywords: Counterscreen, FRET assay, HTS, YIC probe, Dose response, Assay Overview: This is a fluorescence resonance energy transfer (FRET)-based b...
In DepthDetails PCBioAssay