BDBM75237 2-[[4-(2,6-dimethylmorpholin-4-yl)sulfonylbenzoyl]amino]-6-ethyl-5,7-dihydro-4H-thieno[2,3-c]pyridine-3-carboxamide::2-[[4-(2,6-dimethylmorpholin-4-yl)sulfonylphenyl]carbonylamino]-6-ethyl-5,7-dihydro-4H-thieno[2,3-c]pyridine-3-carboxamide::2-[[4-(2,6-dimethylmorpholino)sulfonylbenzoyl]amino]-6-ethyl-5,7-dihydro-4H-thieno[2,3-c]pyridine-3-carboxamide::2-[[[4-[(2,6-dimethyl-4-morpholinyl)sulfonyl]phenyl]-oxomethyl]amino]-6-ethyl-5,7-dihydro-4H-thieno[2,3-c]pyridine-3-carboxamide::MLS001031324::SMR000634466::cid_3285786
SMILES CCN1CCc2c(C1)sc(NC(=O)c1ccc(cc1)S(=O)(=O)N1CC(C)OC(C)C1)c2C(N)=O
InChI Key InChIKey=YSABFGJJUNTTEZ-UHFFFAOYSA-N
Data  1 EC50
  Tab Delimited (TSV)   2D SDfile   Computed 3D by Vconf -m prep SDfile
Find this compound or compounds like it in BindingDB:
Activity Spreadsheet -- Enzyme Inhibition Constant Data from BindingDB
Found 1 hit for monomerid = 75237
TargetImportin subunit alpha-1(Homo sapiens (Human))
Broad Institute
Curated by PubChem BioAssay
LigandPNGBDBM75237(2-[[4-(2,6-dimethylmorpholin-4-yl)sulfonylbenzoyl]...)
Affinity DataEC50:  7.84E+4nM. Assay description: Keywords: Counterscreen, FRET assay, HTS, YIC probe, Dose response, Assay Overview: This is a fluorescence resonance energy transfer (FRET)-based b...
In DepthDetails PCBioAssay