BDBM75515 MLS000971239::N-[2-(2-methoxy-1-oxoethyl)-3,4-dihydro-1H-isoquinolin-7-yl]-4-(trifluoromethyl)benzamide::N-[2-(2-methoxyacetyl)-3,4-dihydro-1H-isoquinolin-7-yl]-4-(trifluoromethyl)benzamide::N-[2-(2-methoxyethanoyl)-3,4-dihydro-1H-isoquinolin-7-yl]-4-(trifluoromethyl)benzamide::N-[2-(methoxyacetyl)-1,2,3,4-tetrahydroisoquinolin-7-yl]-4-(trifluoromethyl)benzamide::SMR000499493::cid_23724026
SMILES COCC(=O)N1CCc2ccc(NC(=O)c3ccc(cc3)C(F)(F)F)cc2C1
InChI Key InChIKey=SFZMDWWWNYNTCA-UHFFFAOYSA-N
Data  2 EC50
  Tab Delimited (TSV)   2D SDfile   Computed 3D by Vconf -m prep SDfile
Find this compound or compounds like it in BindingDB:
Activity Spreadsheet -- Enzyme Inhibition Constant Data from BindingDB
Found 2 hits for monomerid = 75515
TargetAryl hydrocarbon receptor(Homo sapiens (Human))
The Scripps Research Institute Molecular Screening Center
Curated by PubChem BioAssay
LigandPNGBDBM75515(MLS000971239 | N-[2-(2-methoxy-1-oxoethyl)-3,4-dih...)
Affinity DataEC50: >1.13E+3nM. Assay description: Source (MLPCN Center Name): The Scripps Research Institute Molecular Screening Center (SRIMSC) Center Affiliation: The Scripps Research Institute (TS...
Ligand InfoPC cidPC sid
In DepthDetails PCBioAssay
TargetNuclear receptor subfamily 1 group I member 2(Homo sapiens (Human))
The Scripps Research Institute Molecular Screening Center
Curated by PubChem BioAssay
LigandPNGBDBM75515(MLS000971239 | N-[2-(2-methoxy-1-oxoethyl)-3,4-dih...)
Affinity DataEC50: >1.16E+5nM. Assay description: Source (MLPCN Center Name): The Scripps Research Institute Molecular Screening Center (SRIMSC) Center Affiliation: The Scripps Research Institute (TS...
Ligand InfoPC cidPC sid
In DepthDetails PCBioAssay