BDBM75788 6-[(2-amino-2-keto-ethyl)thio]-5-cyano-2-keto-4-o-phenetyl-3,4-dihydro-1H-pyridine-3-carboxylic acid ethyl ester::6-[(2-amino-2-oxoethyl)thio]-5-cyano-4-(2-ethoxyphenyl)-2-oxo-3,4-dihydro-1H-pyridine-3-carboxylic acid ethyl ester::MLS000111500::SMR000107422::cid_2908155::ethyl 6-(2-amino-2-oxoethyl)sulfanyl-5-cyano-4-(2-ethoxyphenyl)-2-oxo-3,4-dihydro-1H-pyridine-3-carboxylate::ethyl 6-(2-azanyl-2-oxidanylidene-ethyl)sulfanyl-5-cyano-4-(2-ethoxyphenyl)-2-oxidanylidene-3,4-dihydro-1H-pyridine-3-carboxylate
SMILES CCOC(=O)C1C(C(C#N)=C(NC1=O)SCC(N)=O)c1ccccc1OCC
InChI Key InChIKey=WBLNACKCVLIIFL-UHFFFAOYSA-N
Data  1 IC50
  Tab Delimited (TSV)   2D SDfile   Computed 3D by Vconf -m prep SDfile
Find this compound or compounds like it in BindingDB:
Activity Spreadsheet -- Enzyme Inhibition Constant Data from BindingDB
Found 1 hit for monomerid = 75788
TargetInsulin-degrading enzyme(Homo sapiens (Human))
The Scripps Research Institute Molecular Screening Center
Curated by PubChem BioAssay
LigandPNGBDBM75788(6-[(2-amino-2-keto-ethyl)thio]-5-cyano-2-keto-4-o-...)
Affinity DataIC50: >6.21E+3nM. Assay description: Source (MLPCN Center Name): The Scripps Research Institute Molecular Screening Center (SRIMSC) Center Affiliation: The Scripps Research Institute (TS...
In DepthDetails PCBioAssay