BDBM75834 5-(4-hydroxy-3,5-dimethyl-benzylidene)-2-thioxo-thiazolidin-4-one::5-[(3,5-dimethyl-4-oxidanyl-phenyl)methylidene]-2-sulfanylidene-1,3-thiazolidin-4-one::5-[(4-hydroxy-3,5-dimethylphenyl)methylidene]-2-sulfanylidene-1,3-thiazolidin-4-one::5-[(4-hydroxy-3,5-dimethylphenyl)methylidene]-2-sulfanylidene-4-thiazolidinone::MLS000758553::SMR000528972::cid_3905060
SMILES Cc1cc(C=C2SC(S)=NC2=O)cc(C)c1O
InChI Key InChIKey=NPYSSQZXRXNSQT-UHFFFAOYSA-N
Data  1 IC50
  Tab Delimited (TSV)   2D SDfile   Computed 3D by Vconf -m prep SDfile
Find this compound or compounds like it in BindingDB:
Activity Spreadsheet -- Enzyme Inhibition Constant Data from BindingDB
Found 1 hit for monomerid = 75834
TargetInsulin-degrading enzyme(Homo sapiens (Human))
The Scripps Research Institute Molecular Screening Center
Curated by PubChem BioAssay
LigandPNGBDBM75834(5-(4-hydroxy-3,5-dimethyl-benzylidene)-2-thioxo-th...)
Affinity DataIC50: >5.60E+4nM. Assay description: Source (MLPCN Center Name): The Scripps Research Institute Molecular Screening Center (SRIMSC) Center Affiliation: The Scripps Research Institute (TS...
In DepthDetails PCBioAssay