BDBM75906 4-(4-methoxyphenoxy)-5-methyl-2-(4-propan-2-ylphenyl)-3-pyridazinone::4-(4-methoxyphenoxy)-5-methyl-2-(4-propan-2-ylphenyl)pyridazin-3-one::4-(4-methoxyphenoxy)-5-methyl-2-p-cumenyl-pyridazin-3-one::SR-02000000428::SR-02000000428-1::cid_46835794
SMILES COc1ccc(Oc2c(C)cnn(-c3ccc(cc3)C(C)C)c2=O)cc1
InChI Key InChIKey=BGWRLXAKBUUMEC-UHFFFAOYSA-N
Data  3 IC50
  Tab Delimited (TSV)   2D SDfile   Computed 3D by Vconf -m prep SDfile
Find this compound or compounds like it in BindingDB:
Activity Spreadsheet -- Enzyme Inhibition Constant Data from BindingDB
Found 3 hits for monomerid = 75906
TargetMelanin-concentrating hormone receptor 1(Homo sapiens (Human))
The Scripps Research Institute Molecular Screening Center
Curated by PubChem BioAssay
LigandPNGBDBM75906(4-(4-methoxyphenoxy)-5-methyl-2-(4-propan-2-ylphen...)
Affinity DataIC50:  9.80E+3nM. Assay description: Source (MLPCN Center Name): The Scripps Research Institute Molecular Screening Center (SRIMSC) Affiliation: The Scripps Research Institute, TSRI Assa...
In DepthDetails PCBioAssay
TargetNeuropeptides B/W receptor type 1(Homo sapiens (Human))
The Scripps Research Institute
Curated by ChEMBL
LigandPNGBDBM75906(4-(4-methoxyphenoxy)-5-methyl-2-(4-propan-2-ylphen...)
Affinity DataIC50:  7.50E+3nM. Assay description: Antagonist activity at human NPBWR1 expressed in HEK293T cells co-expressing Galphaqi3 assessed as calcium release after 15 mins by FLIPR assay assay
In DepthDetails ArticlePubMed
TargetNeuropeptides B/W receptor type 1(Homo sapiens (Human))
The Scripps Research Institute
Curated by ChEMBL
LigandPNGBDBM75906(4-(4-methoxyphenoxy)-5-methyl-2-(4-propan-2-ylphen...)
Affinity DataIC50:  7.50E+3nM. Assay description: Source (MLPCN Center Name): The Scripps Research Institute Molecular Screening Center (SRIMSC) Affiliation: The Scripps Research Institute, TSRI Assa...
In DepthDetails PCBioAssay