BDBM75944 3-[4-chloro-5-(4-methoxyphenoxy)-6-oxo-1-pyridazinyl]benzoic acid ethyl ester::3-[4-chloro-6-keto-5-(4-methoxyphenoxy)pyridazin-1-yl]benzoic acid ethyl ester::SR-02000000480::SR-02000000480-1::cid_46850890::ethyl 3-[4-chloranyl-5-(4-methoxyphenoxy)-6-oxidanylidene-pyridazin-1-yl]benzoate::ethyl 3-[4-chloro-5-(4-methoxyphenoxy)-6-oxopyridazin-1-yl]benzoate
SMILES CCOC(=O)c1cccc(c1)-n1ncc(Cl)c(Oc2ccc(OC)cc2)c1=O
InChI Key InChIKey=CIILEJHKOUMREY-UHFFFAOYSA-N
Data  2 IC50
  Tab Delimited (TSV)   2D SDfile   Computed 3D by Vconf -m prep SDfile
Find this compound or compounds like it in BindingDB:
Activity Spreadsheet -- Enzyme Inhibition Constant Data from BindingDB
Found 2 hits for monomerid = 75944
TargetNeuropeptides B/W receptor type 1(Homo sapiens (Human))
The Scripps Research Institute Molecular Screening Center
Curated by PubChem BioAssay
LigandPNGBDBM75944(3-[4-chloro-5-(4-methoxyphenoxy)-6-oxo-1-pyridazin...)
Affinity DataIC50:  1.10E+3nM. Assay description: Source (MLPCN Center Name): The Scripps Research Institute Molecular Screening Center (SRIMSC) Affiliation: The Scripps Research Institute, TSRI Assa...
In DepthDetails PCBioAssay
TargetMelanin-concentrating hormone receptor 1(Homo sapiens (Human))
The Scripps Research Institute Molecular Screening Center
Curated by PubChem BioAssay
LigandPNGBDBM75944(3-[4-chloro-5-(4-methoxyphenoxy)-6-oxo-1-pyridazin...)
Affinity DataIC50:  3.70E+3nM. Assay description: Source (MLPCN Center Name): The Scripps Research Institute Molecular Screening Center (SRIMSC) Affiliation: The Scripps Research Institute, TSRI Assa...
In DepthDetails PCBioAssay