BDBM75957 MLS000027581::SMR000035355::cid_662204
SMILES COc1ccc(cc1)-c1oc2ncn3nc(Cc4ccccc4)nc3c2c1-c1ccc(OC)cc1
InChI Key InChIKey=AUAKLPCUGKZVOG-UHFFFAOYSA-N
Data  2 IC50
  Tab Delimited (TSV)   2D SDfile   Computed 3D by Vconf -m prep SDfile
Find this compound or compounds like it in BindingDB:
Activity Spreadsheet -- Enzyme Inhibition Constant Data from BindingDB
Found 2 hits for monomerid = 75957
TargetPhotoreceptor-specific nuclear receptor(Homo sapiens (Human))
The Scripps Research Institute Molecular Screening Center
Curated by PubChem BioAssay
LigandPNGBDBM75957(MLS000027581 | SMR000035355 | cid_662204)
Affinity DataIC50:  7.69E+3nM. Assay description: Source (MLPCN Center Name): The Scripps Research Institute Molecular Screening Center Affiliation: The Scripps Research Institute, TSRI Assay Provide...
In DepthDetails PCBioAssay
TargetIsoform 2 of Nuclear receptor corepressor 2 (TRAC-1)(Homo sapiens (Human))
The Scripps Research Institute Molecular Screening Center
Curated by PubChem BioAssay
LigandPNGBDBM75957(MLS000027581 | SMR000035355 | cid_662204)
Affinity DataIC50:  6.02E+3nM. Assay description: Source (MLPCN Center Name): The Scripps Research Institute Molecular Screening Center Affiliation: The Scripps Research Institute, TSRI Assay Provide...
In DepthDetails PCBioAssay