BDBM76490 MLS000680887::N-({[4-(dimethylamino)phenyl]amino}carbonothioyl)-3-methoxybenzamide::N-[[4-(dimethylamino)anilino]-sulfanylidenemethyl]-3-methoxybenzamide::N-[[4-(dimethylamino)phenyl]carbamothioyl]-3-methoxy-benzamide::N-[[4-(dimethylamino)phenyl]carbamothioyl]-3-methoxybenzamide::N-[[4-(dimethylamino)phenyl]thiocarbamoyl]-3-methoxy-benzamide::SMR000269547::cid_883668
SMILES COc1cccc(c1)C(=O)NC(=S)Nc1ccc(cc1)N(C)C
InChI Key InChIKey=ZFIJJDPVZOSOIG-UHFFFAOYSA-N
Data  3 IC50
  Tab Delimited (TSV)   2D SDfile   Computed 3D by Vconf -m prep SDfile
Find this compound or compounds like it in BindingDB:
Activity Spreadsheet -- Enzyme Inhibition Constant Data from BindingDB
Found 3 hits for monomerid = 76490
TargetSentrin-specific protease 8(Homo sapiens (Human))
Burnham Center For Chemical Genomics
Curated by PubChem BioAssay
LigandPNGBDBM76490(MLS000680887 | N-({[4-(dimethylamino)phenyl]amino}...)
Affinity DataIC50:  2.10E+4nM. Assay description: Data Source: Sanford-Burnham Center for Chemical Genomics (SBCCG) Source Affiliation: Sanford-Burnham Medical Research Institute (SBMRI, San Diego, C...
In DepthDetails PCBioAssay
TargetCaspase-3(Homo sapiens (Human))
Burnham Center For Chemical Genomics
Curated by PubChem BioAssay
LigandPNGBDBM76490(MLS000680887 | N-({[4-(dimethylamino)phenyl]amino}...)
Affinity DataIC50:  1.07E+4nM. Assay description: Data Source: Sanford-Burnham Center for Chemical Genomics (SBCCG) Source Affiliation: Sanford-Burnham Medical Research Institute (SBMRI, San Diego, C...
In DepthDetails PCBioAssay
TargetSentrin-specific protease 6(Homo sapiens (Human))
Burnham Center For Chemical Genomics
Curated by PubChem BioAssay
LigandPNGBDBM76490(MLS000680887 | N-({[4-(dimethylamino)phenyl]amino}...)
Affinity DataIC50:  1.61E+4nM. Assay description: Data Source: Sanford-Burnham Center for Chemical Genomics (SBCCG) Source Affiliation: Sanford-Burnham Medical Research Institute (SBMRI, San Diego, C...
In DepthDetails PCBioAssay