BDBM76614 1-(4-anilinophenyl)-3-phenyl-urea::1-(4-anilinophenyl)-3-phenylurea::1-phenyl-3-(4-phenylazanylphenyl)urea::MLS001180135::N-(4-anilinophenyl)-N'-phenylurea::SMR000477094::cid_295253
SMILES O=C(Nc1ccccc1)Nc1ccc(Nc2ccccc2)cc1
InChI Key InChIKey=OTWRTYVZRQVRKX-UHFFFAOYSA-N
Data  3 IC50
  Tab Delimited (TSV)   2D SDfile   Computed 3D by Vconf -m prep SDfile
Find this compound or compounds like it in BindingDB:
Activity Spreadsheet -- Enzyme Inhibition Constant Data from BindingDB
Found 3 hits for monomerid = 76614
TargetCaspase-3(Homo sapiens (Human))
Burnham Center For Chemical Genomics
Curated by PubChem BioAssay
LigandPNGBDBM76614(1-(4-anilinophenyl)-3-phenyl-urea | 1-(4-anilinoph...)
Affinity DataIC50:  3.67E+4nM. Assay description: Data Source: Sanford-Burnham Center for Chemical Genomics (SBCCG) Source Affiliation: Sanford-Burnham Medical Research Institute (SBMRI, San Diego, C...
In DepthDetails PCBioAssay
TargetSentrin-specific protease 6(Homo sapiens (Human))
Burnham Center For Chemical Genomics
Curated by PubChem BioAssay
LigandPNGBDBM76614(1-(4-anilinophenyl)-3-phenyl-urea | 1-(4-anilinoph...)
Affinity DataIC50: >1.00E+5nM. Assay description: Data Source: Sanford-Burnham Center for Chemical Genomics (SBCCG) Source Affiliation: Sanford-Burnham Medical Research Institute (SBMRI, San Diego, C...
In DepthDetails PCBioAssay
TargetSentrin-specific protease 8(Homo sapiens (Human))
Burnham Center For Chemical Genomics
Curated by PubChem BioAssay
LigandPNGBDBM76614(1-(4-anilinophenyl)-3-phenyl-urea | 1-(4-anilinoph...)
Affinity DataIC50: >1.00E+5nM. Assay description: Data Source: Sanford-Burnham Center for Chemical Genomics (SBCCG) Source Affiliation: Sanford-Burnham Medical Research Institute (SBMRI, San Diego, C...
In DepthDetails PCBioAssay