BDBM76853 US9546164, 584::US9694002, 579::US9694002, 584
SMILES CS(=O)(=O)NC(=O)c1cc(C2CC2)c(OCC2CCN(Cc3ccc(Cl)cc3C(F)(F)F)CC2)cc1F
InChI Key InChIKey=YLOGZZPFMFZBLY-UHFFFAOYSA-N
Data  4 IC50
  Tab Delimited (TSV)   2D SDfile   Computed 3D by Vconf -m prep SDfile
Find this compound or compounds like it in BindingDB:
Activity Spreadsheet -- Enzyme Inhibition Constant Data from BindingDB
Found 4 hits for monomerid = 76853
TargetSodium channel protein type 1/10/11/2/3/4/5/8/9 subunit alpha(Homo sapiens (Human))
Genentech
US Patent
LigandPNGBDBM76853(US9546164, 584 | US9694002, 579 | US9694002, 584)
Affinity DataIC50:  2.90nMpH: 7.4 T: 2°C. Assay description: Binding of this radioligand was preformed in 5 mL borosilicate glass test tubes at room temperature. Binding was initiated by adding membranes to inc...
In DepthDetails US Patent
TargetSodium channel protein type 5 subunit alpha(Homo sapiens (Human))
Genentech
US Patent
LigandPNGBDBM76853(US9546164, 584 | US9694002, 579 | US9694002, 584)
Affinity DataIC50:  2.90nMpH: 7.4 T: 2°C. Assay description: Radioligand Binding Studies: Saturation experiments. A representative compound of formula (I) having a methyl group was tritiated. Three tritiums wer...
In DepthDetails US Patent
TargetSodium channel protein type 5 subunit alpha(Homo sapiens (Human))
Genentech
US Patent
LigandPNGBDBM76853(US9546164, 584 | US9694002, 579 | US9694002, 584)
Affinity DataIC50:  2.90nMpH: 7.4 T: 2°C. Assay description: Radioligand Binding Studies: Saturation experiments. A representative compound of formula (I) having a methyl group was tritiated. Three tritiums wer...
In DepthDetails US Patent
TargetSodium channel protein type 1/10/11/2/3/4/5/8/9 subunit alpha(Homo sapiens (Human))
Genentech
US Patent
LigandPNGBDBM76853(US9546164, 584 | US9694002, 579 | US9694002, 584)
Affinity DataIC50:  2.90nMpH: 7.4 T: 2°C. Assay description: Binding of this radioligand was preformed in 5 mL borosilicate glass test tubes at room temperature. Binding was initiated by adding membranes to inc...
In DepthDetails US Patent