BDBM76914 MLS000087888::N-[2-(4-methylphenyl)-2,6-dihydro-4H-thieno[3,4-c]pyrazol-3-yl]thiophene-2-carboxamide::N-[2-(4-methylphenyl)-4,6-dihydrothieno[3,4-c]pyrazol-3-yl]-2-thiophenecarboxamide::N-[2-(4-methylphenyl)-4,6-dihydrothieno[3,4-c]pyrazol-3-yl]thiophene-2-carboxamide::N-[2-(p-tolyl)-4,6-dihydrothieno[3,4-c]pyrazol-3-yl]thiophene-2-carboxamide::SMR000024207::cid_3235680
SMILES Cc1ccc(cc1)-n1nc2CSCc2c1NC(=O)c1cccs1
InChI Key InChIKey=SOBDWVFMGUCUET-UHFFFAOYSA-N
Data  1 IC50  1 EC50
  Tab Delimited (TSV)   2D SDfile   Computed 3D by Vconf -m prep SDfile
Find this compound or compounds like it in BindingDB:
Activity Spreadsheet -- Enzyme Inhibition Constant Data from BindingDB
Found 2 hits for monomerid = 76914
TargetProbable nicotinate-nucleotide adenylyltransferase(Staphylococcus aureus subsp. aureus N315)
Burnham Center For Chemical Genomics
Curated by PubChem BioAssay
LigandPNGBDBM76914(MLS000087888 | N-[2-(4-methylphenyl)-2,6-dihydro-4...)
Affinity DataIC50:  1.62E+4nM
In DepthDetails PCBioAssay
TargetVoltage-dependent T-type calcium channel subunit alpha-1H(Homo sapiens (Human))
Vanderbilt Screening Center For Gpcrs, Ion Channels And Transporters
Curated by PubChem BioAssay
LigandPNGBDBM76914(MLS000087888 | N-[2-(4-methylphenyl)-2,6-dihydro-4...)
Affinity DataEC50:  558nM. Assay description: Assay Provider: Xinmin Xie Assay Provider Affiliation: Bioscience Division, SRI International, Menlo Park, CA Grant Title: HTS Assay for Cav3 T-Type ...
In DepthDetails PCBioAssay